{"text_format":"1","workbook":"xlsx","n_sheets":9,"sheets":["Home","TermsAndConditions","Menu","Help","Maintenance","Options","Calculator","CostPrices","eBay Fees"],"not_rendered":{"charts":0,"images":1,"macros":1,"external_links":0,"defined_names":0,"comments":0,"pivot_tables":0},"unopened":[],"bounds":{"document_bytes":16777216,"sheet_cells":100000,"rows_first":2000,"rows_last":500,"rows_between":2000,"halvings":0,"cell_chars":16384,"cell_head_chars":4096},"cells_cut":0,"cells_raw":0,"read":"whole","date_system":"1900"}

{"sheet":"Home","index":0,"n_rows":20,"n_cols":5,"rows_kept":20,"cut":false,"hidden":false,"merged":[[19,2,21,12],[18,2,18,12],[1,2,1,3],[6,4,16,10],[2,2,2,12],[4,2,4,12],[15,11,16,13]]}
[]
[null,null,"Version 2.0-Beta"]
[null,null,"CritchCorp Computers Ltd"]
[]
[null,null,"Market Place Price Calculator"]
[]
[null,null,null,null,"This worksheet will not work unless you have your security setting set correctly. If the buttons don't work, then go to:\nFile --> Options --> Trust Center\nClick the Trust Center Settings Button\nGoto Macro Settings\nSelect Enable VBA Macros...\nTick the other two boxes if available\nClick OK\nClose Excel and reopen this file.\nThis is an Beta Version of 2.0. The calculator works but the rest is still in development."]
[]
[]
[]
[]
[]
[]
[]
[]
[]
[]
[]
[null,null,"© 2024 CritchCorp Computers Ltd"]
[null,null,"CritchCorp Computers Ltd is a company registered in England And Wales, registered number: 05928822, registered address: 132-134 Great Ancoats Street, Manchester, M4 6DE\n(Official Documents Only)"]

{"sheet":"TermsAndConditions","index":1,"n_rows":18,"n_cols":1,"rows_kept":18,"cut":false,"hidden":true,"merged":[]}
[]
["Use at your own risk at the moment. No guarantees apply. Merchantability of this software is not guaranteed."]
[]
["This software is in Beta testing. It is not for general release and as such no guarantees apply at all."]
[]
["This software is intended for use a huide only. It doe not gaurentee you will make a profit on every sale. It is to be used a guide only."]
["It doe not take in to account other costs of business and other costs directly associated with each sale. "]
["There are other costs, such as Pay-Per-Click and other advertising fees that are not accounted for in this software."]
["You must take these extra costs in to account yourself. If you can add a percentage to the unit costs, then you can easily do so."]
["If you cannot then you must make provisions for these in some other way."]
["By using this software you agree not hold us liable for any losses you may incude due to using the software."]
["You also agree to not attempt to interfere with the code. Any attempt or actual changing of the code will invalidate the software and in such cases no warraty will be applied"]
["Further more, if you notice a glitch, or problem, then as a Beta tester, or a user of the Beta software, you are duty bound to report it ASAP."]
[]
["E&OE accepted"]
[]
[]
["CritchCorp Computers Ltd"]

{"sheet":"Menu","index":2,"n_rows":33,"n_cols":2,"rows_kept":33,"cut":false,"hidden":true,"merged":[[31,1,31,8],[32,1,32,2],[1,1,2,11],[5,1,6,11]]}
[]
[null,"CritchCorp Computers Ltd"]
[]
[]
[]
[null,"Main Menu"]
[]
[]
[]
[]
[]
[]
[]
[]
[]
[]
[]
[]
[]
[]
[]
[]
[]
[]
[]
[]
[]
[]
[]
[]
[]
[null,"© 2024 CritchCorp Computers Ltd"]
[null,{"$f":"Home!C2","v":"Version 2.0-Beta"}]

{"sheet":"Help","index":3,"n_rows":32,"n_cols":1,"rows_kept":32,"cut":false,"hidden":true,"merged":[[20,0,28,27],[29,0,29,27],[31,0,38,27]]}
["Work In Progress…."]
[]
[]
[]
[]
[]
[]
[]
[]
[]
[]
[]
[]
[]
[]
[]
[]
[]
["To use the Calculator"]
[]
["First Select the Market Place or App you want to use, from the buttons on the left (marked 1 on the picture). Selecting the correct one is important as it will set up some feautres for that particular app or marketplace. For example setting it to Shopify will set the per transaction fee to £0.25, it will exclude VAT from that fee and it will set the category fee to 3.9%, as this is the most charged by the payment processors. (you can amend any of these as well. More about that later).\nOnce you have selected your marketplace or app, you can enter your item specifc category fee, add fee as required (Marked as 2). The Foriegn fee and Charity fee are eBay specific but you can use if they are needed for other things. One has VAT and one does not, depending on what you are charged.\nOn to 3 on the diagram and you should enter your cost price for the item. That is the entire cost including the post and packing import duty, etc that you paid (or will pay).\n4 - There are 2 of these, you should use only one usually. The Postage column is for Royal Mail postage which does not include any VAT. The other is for courier who charge VAT (Including Royal Mail Business accounts).\nThen in 5 enter the sale price, 6 the amount your customer pays for delivery and 7 the quantity (not bundels, as they are usually one item and costed as such, this will multiply the cost and sale price by this number.\nNow head on over to number 8 and see if you are losing or profiting."]
[]
[]
[]
[]
[]
[]
[]
[]
["This doesn't take in to account any other costs. If you know what margin must be added in order to cover your other costs, make sure you add it to the unit cost price, or as one of the other percentages if available."]
[]
["There are 3 calculators on the right side.\nThe first is a calculates how much VAT to add: Enter the cost with out VAT and it will tell you how much it is with VAT.\nThe second will remove the VAT.\nThe third is to help with multibuy discounts. Put your sales price in and then use the discount amount in the calculator to see if you still make a profit or not. The OTher box can be used fro your own discount amount, other than the fix boxes."]

{"sheet":"Maintenance","index":4,"n_rows":34,"n_cols":2,"rows_kept":34,"cut":false,"hidden":true,"merged":[[33,1,33,8],[7,0,7,1],[6,0,6,1]]}
["This is the Maintenance page, there is nothing here for you. Please return to the menu."]
[]
[]
[]
[]
[]
["Password Section"]
["Password1!"]
[0]
[]
[]
[]
[]
[]
[]
[]
[]
[]
[]
[]
[]
[]
[]
[]
[]
[]
[]
[]
[]
[]
[]
[]
[]
[null,"© 2024 CritchCorp Computers Ltd"]

{"sheet":"Options","index":5,"n_rows":32,"n_cols":7,"rows_kept":32,"cut":false,"hidden":true,"merged":[]}
[]
[]
[]
[]
[]
["Current Button Settings",null,null,"Shopify"]
["Fixed Order Fee",0.25,null,"Fixed Order Fee",0.25,"Variable Fee",3.9]
["VAT on FOF",1,null,"VAT on FOF",0]
[]
[null,6.5,null,"OnBuy"]
[null,null,null,"Fixed Order Fee",0.25]
[null,null,null,"VAT on FOF",1]
[]
[null,null,null,"eBay"]
[null,null,null,"Fixed Order Fee",0.35]
[null,null,null,"VAT on FOF",1]
[]
[null,null,null,"WooCommerce"]
[null,null,null,"Fixed Order Fee",0.35,"Variable Fee",3.9]
[null,null,null,"Vat on FOF",1]
[]
[null,null,null,"Amazon"]
[null,null,null,"Fixed Order Fee",0.25]
[null,null,null,"VAT on FOF",1]
[]
[null,null,null,"Vinted"]
[null,null,null,"Fixed Order Fee",0.5]
[null,null,null,"VAT on FOF",1]
[]
[null,null,null,"Etsy"]
["© 2024 CritchCorp Computers Ltd",null,null,"Fixed Order Fee",0.2,"Variable Fee",6.5]
[null,null,null,"VAT on FOF",1]

{"sheet":"Calculator","index":6,"n_rows":42,"n_cols":21,"rows_kept":42,"cut":false,"hidden":true,"merged":[[0,16,0,18],[33,1,33,22],[1,2,1,5],[9,12,9,15],[13,12,13,15],[17,12,17,15],[18,14,18,19],[8,5,8,10],[4,19,4,21],[5,19,5,21]]}
[null,null,null,null,null,null,null,null,null,null,null,null,null,null,null,null,{"$f":"Home!C2","v":"Version 2.0-Beta"}]
[null,null,"Quick Calculator for market places"]
[null,null,null,null,"Inc VAT","Inc VAT","INC VAT",null,null,null,"No-VAT",null,null,null,null,"0-VAT","Inc-VAT"]
[null,null,"Description","Quantity","Sale Price","Delivery","Total sale","VAT","ebay fee","promo fee","Charity Fee","foriegn fee","Courier","Unit Cost inc VAT","Other cost","POSTAGE","Total costs","VAT Reclaim","Profit/Loss"]
[null,null,"With VAT",1,6.5,0,{"$f":"(E5*D5+(F5))","v":6.5},{"$f":"G5-(G5/B8)","v":1.083333333333333},{"$f":"IF(Options!B8=0,(G5*(B10/100)+Options!B7),((G5*(B10/100)+Options!B7)+((G5*(B10/100)+Options!B7)*(B8-1))))","v":1.3842000000000001},{"$f":"IF(Options!B8=0,(G5*(B11/100)), ((G5*(B11/100))+((G5*(B11/100))*(B8-1))))","v":1.0842000000000001},{"$f":"(G5*(B13/100))","v":0},{"$f":"IF(Options!B8=0,(G5*(B12/100)), ((G5*(B12/100))+((G5*(B12/100))*(B8-1))))","v":0},{"$f":"M6*B8","v":3.468},{"$f":"N6*B8","v":0.26400000000000001},{"$f":"O6","v":0},{"$f":"P6","v":0},{"$f":"SUM(H5:P5)-N5+(N5*D5)","v":7.2837333333333332},{"$f":"(I7)+(J7)+(L7)+(M7)+(O7)+((N7)*D5)","v":1.0333999999999997},{"$f":"SUM((G5-Q5))+R5","v":0.24966666666666648},"Vat Registered - Use this"]
[null,null,"No VAT",{"$f":"D5","v":1},{"$f":"E5/B8","v":5.416666666666667},{"$f":"F5/B8","v":0},{"$f":"(E6*D6+(F6))","v":5.416666666666667},{"$f":"G5-(G5/B8)","v":1.083333333333333},{"$f":"(G5*(B10/100)+Options!B7)","v":1.1535000000000002},{"$f":"(G5*(B11/100))","v":0.90350000000000008},{"$f":"(G5*(B13/100))","v":0},{"$f":"(G5*(B12/100))","v":0},2.89,0.22,null,0,{"$f":"SUM(I5:P5)-N5+(N5*D5)","v":6.2004000000000001},null,{"$f":"SUM((G6-Q6))","v":-0.78373333333333317},"Not VAT registered - Use This"]
[null,null,null,null,null,null,{"$f":"SUM(G5-G6)","v":1.083333333333333},null,{"$f":"I5-I6","v":0.23069999999999991},{"$f":"J5-J6","v":0.18069999999999997},null,{"$f":"L5-L6","v":0},{"$f":"M5-M6","v":0.57799999999999985},{"$f":"N5-N6","v":4.4000000000000011E-2},null,null,{"$f":"Q5-Q6","v":1.083333333333333},{"$f":"SUM(I7:J7,L7:O7)","v":1.0333999999999997}]
[null,{"$f":"(B9/100)+1","v":1.2}]
["VAT",20,null,null,null,"Red in delivery value incates that there is a non zero value"]
["Category Fee %",13.9,null,null,null,null,null,null,null,null,null,null,"Unit Cost VAT calculator"]
["Per Sale Ad Fee %",13.9,null,null,null,null,null,null,null,null,null,null,"Qty","Unit Cost","VAT","Total","Unit Total"]
["Foreign Sale %",0,"Mostly for eBay but you use for anything that you need it for (Inc VAT)",null,null,null,null,null,null,null,null,null,8,1,{"$f":"(N12*M12)*(B8-1)","v":1.5999999999999996},{"$f":"(N12*M12)+O12","v":9.6},{"$f":"N12*M12","v":8}]
["Charity % (No VAT)",0,"Mostly for eBay but you use for anything that you need it for (Exl VAT)"]
["Shopify",0,null,null,null,null,null,null,null,null,null,null,"Unit Cost VAT Remover"]
["OnBuy",0,null,null,null,null,null,null,null,null,null,null,"Qty","Unit cost","VAT","Total"]
["eBay",0,null,null,null,null,null,null,null,null,null,null,1,6,{"$f":"(N16*M16)-(N16*M16)/B8","v":1},{"$f":"(N16*M16)/B8","v":5}]
["WooCommerce",0]
["Amazon",1,null,null,null,null,null,null,null,null,null,null,"Discount Calculator"]
["Vinted",0,null,null,null,null,null,null,null,null,null,null,null,null,"Discount Percentage",null,null,null,null,null,"Other"]
["Etsy",0,null,null,null,null,null,null,null,null,null,null,"Qty","Sale price inc VAT",0.05,0.1,0.15,0.2,0.25,0.3,35]
["TikTok Shop",0,null,null,null,null,null,null,null,null,null,null,1,13.95,{"$f":"N21-(N21*(5/100))","v":13.2525},{"$f":"$N$21-($N$21*(10/100))","v":12.555},{"$f":"$N$21-($N$21*(15/100))","v":11.8575},{"$f":"$N$21-($N$21*(20/100))","v":11.16},{"$f":"$N$21-($N$21*(25/100))","v":10.462499999999999},{"$f":"$N$21-($N$21*(30/100))","v":9.7650000000000006},{"$f":"$N$21-($N$21*(U20/100))","v":9.067499999999999}]
["Facebook Marketplace",0]
[]
[]
[]
[]
[]
[]
[]
[]
[]
[]
[]
[null,"© 2024 CritchCorp Computers Ltd"]
[]
[]
[]
[]
[]
[]
[null,null,"S96 TV Stick"]
[null,null,null,18.2,"New Price 17.02"]

{"sheet":"CostPrices","index":7,"n_rows":2,"n_cols":29,"rows_kept":2,"cut":false,"hidden":true,"merged":[[0,4,0,10]]}
[null,null,null,null,"This sheet is being reconstructed. It is intended as a way to keep track of your cost prices and %'s for easy reference. It is may be useful to use it to autofil the calculator.",null,null,null,null,null,null,"This maybecome a drop-down list"]
["Supplier/Manufacturer","Short Description","UPC/EAN","SKU","Unit Cost Pice","Unit RRP","Unit Weight (Kg)","Unit height (CM)","Unit Width (CM)","Unit Depth (CM)","Shipping Weight (KG)","Shipping box dimentions","Shopify Price","Shopify %","OnBuy Price","OnBuy  Category Fee %","OnBuy Boost %","eBay Rpice","eBay Fee %","Promoted Listing Simple Fee %","Woo Price","Woo Payment Processor %","Amazon Price","Amazon Category Fee %","Amazon Ad %","Vinted Price","Vinted category %","Etsy Price","Etsy Category %"]

{"sheet":"eBay Fees","index":8,"n_rows":142,"n_cols":18,"rows_kept":142,"cut":false,"hidden":true,"merged":[[4,0,4,2],[8,0,9,0],[8,1,9,1],[8,2,9,2],[82,0,83,0],[82,1,83,1],[20,0,22,0],[20,1,22,1],[32,2,34,2],[47,0,48,0],[47,1,48,1],[47,2,48,2],[51,0,52,0],[51,1,52,1],[71,1,73,1],[51,2,52,2],[53,0,54,0],[53,1,54,1],[53,2,54,2],[55,0,57,0],[55,1,57,1],[117,0,118,0],[117,1,118,1],[117,2,118,2],[95,0,96,0],[95,1,96,1],[95,2,96,2],[99,0,100,0],[99,1,100,1],[99,2,100,2],[101,0,103,0],[101,1,103,1],[17,12,18,12],[17,14,18,14],[4,4,4,10],[0,0,3,2],[112,0,114,0],[112,1,114,1],[74,0,76,0],[74,1,76,1],[78,0,80,0],[78,1,80,1],[82,2,83,2],[58,0,60,0],[58,1,60,1],[64,0,66,0],[64,1,66,1],[71,0,73,0],[4,16,4,17],[26,12,27,12],[26,14,27,14],[38,12,39,12],[38,14,39,14],[4,12,4,14],[19,12,20,12],[19,14,20,14],[21,12,22,12],[21,14,22,14],[24,12,25,12],[24,14,25,14],[7,12,8,12],[7,14,8,14],[12,12,13,12],[12,14,13,14]]}
["These are the market place fee. They are for reference only and up-to-date as of 20/07/2024. There is no gurentee of their correctness and are copied form the relevant website. \nYou can usually tell the fee you are paying by looking at your listing."]
[]
[]
[]
["Final value fees by category - eBay",null,null,null,"Final Value Fees for Amazon",null,null,null,null,null,null,null,"OnBuy Fees from August 2024",null,null,null,"Etsy"]
["Category","Category ID","Final value fee % + 30p per order",null,"Referral Fee Schedule",null,null,null,null,null,null,null,"Fee Category","Sales Fees","Minimum Fee per Product",null,"Fee Category","Fee %"]
["Antiques","#20081",0.109,null,"Fee categories",null,null,null,null,null,null,null,"Arts, Crafts & Sewing",0.15,0.25,null,"All",0.06]
["Art, except subcategories below:","#550",0.109,null," Referral fee (including the digital services tax)",null,null,null,null,null,null,null,"Baby & Toddler","8.00% of the total item price up to the value of £10.00",0.25]
["Art NFTs","#262051",0.05,null,"  Per-item minimum referral fee",null,null,null,null,null,null,null,null,"15.00% on any portion of the total item price greater than £10.00"]
[null,null,null,null,null,null,null,null,null,null,null,null,"Beer, Wine & Spirits",0.1,0.25]
["Baby","#2984",0.109,null,"Amazon Device Accessories",null,null,null,null,null,null,null,"Books",0.15,0.25]
["Books, Comics & Magazines","#267",9.9000000000000005E-2,null,0.45900000000000002,null,null,null,null,null,null,null,"Business, Office & Industrial Supplies",0.15,0.25]
["Business, Office & Industrial","#12576",0.11899999999999999,null,0.25,null,null,null,null,null,null,null,"Car & Automotive Parts","15.00% of the total item price up to the value of £45.00",0.25]
["Cameras & Photography, except subcategories below:","#625",9.9000000000000005E-2,null,"Automotive and Powersports",null,null,null,null,null,null,null,null,"9.00% on any portion of the total item price greater than £45.00"]
["Camcorders","#11724","6.9% for the portion of the total amount of the sale up to £1,000 (calculated per item)",null,"• 15.3% for the portion of the total sales price up to £45.00",null,null,null,null,null,null,null,"Clothing, Shoes & Accessories",0.15,0.25]
["Digital Cameras","#31388","3% for the portion of the total amount of the sale above £1,000",null,"• 9.18% for any portion of the total sales price greater than £45.00",null,null,null,null,null,null,null,"Consumer Electronics",7.0000000000000007E-2,0.25]
["Film Photography","#69323",null,null,0.25,null,null,null,null,null,null,null,"DIY & Tools",0.13,0.25]
["Lenses & Filters","#78997",null,null,"Baby Products",null,null,null,null,null,null,null,"Electronic Accessories","15.00% of the total item price up to the value of £100.00",0.25]
[null,null,null,null,"• 8.16% for products with a total sales price up to £10.00",null,null,null,null,null,null,null,null,"8.00% on any portion of the total item price greater than £100.00"]
["Clothes, Shoes & Accessories, except subcategories below:","#11450",0.11899999999999999,null,"• 15.3% for products with a total sales price greater than £10.00",null,null,null,null,null,null,null,"Food & Drink","8.00% of the total item price up to the value of £10.00",0.25]
["Women's Bags & Handbags","#169291","12.9% for the portion of the total amount of the sale up to £800 (calculated per item)",null,0.25,null,null,null,null,null,null,null,null,"15.00% on any portion of the total item price greater than £10.00"]
[null,null,"7% for the portion of the total amount of the sale above £800",null,"Backpacks and Handbags",null,null,null,null,null,null,null,"Furniture","15.00% of the total item price up to the value of £175.00",0.25]
[null,null,null,null,0.153,null,null,null,null,null,null,null,null,"10.00% on any portion of the total item price greater than £175.00"]
["Men > Men's Shoes > Trainers","#15709",0.11899999999999999,null,0.25,null,null,null,null,null,null,null,"Games Consoles",0.08,0.25]
["Women > Women's Shoes > Trainers",null,null,null,"Beauty, Health, and Personal Care*",null,null,null,null,null,null,null,"Health & Beauty","8.00% of the total item price up to the value of £10.00",0.25]
[null,"#95672",null,null,"• 8.16% for products with a total sales price up to £10.00",null,null,null,null,null,null,null,null,"15.00% on any portion of the total item price greater than £10.00"]
[null,null,null,null,"• 15.3% for products with a total sales price greater than £10.00",null,null,null,null,null,null,null,"Jewellery","20.00% of the total item price up to the value of £225.00",0.25]
[null,null,"7% if item selling price* is £100 or more",null,0.25,null,null,null,null,null,null,null,null,"5.00% on any portion of the total item price greater than £225.00"]
[null,null,null,null,"Beer, Wine, and Spirits",null,null,null,null,null,null,null,"Large Appliances",7.0000000000000007E-2,0.25]
[null,null,"*The item selling price excludes postage, and any other additional fees or taxes",null,0.10199999999999999,null,null,null,null,null,null,null,"Music, VHS, DVD",0.15,0.25]
["Coins","#11116",0.109,null,0.25,null,null,null,null,null,null,null,"Musical Instruments & DJ",0.12,0.25]
["Collectables, except subcategories below:","#1",0.109,null,"Books",null,null,null,null,null,null,null,"Pet Supplies",0.15,0.25]
["Emerging NFTs","#262050",0.05,null,"• 15.3%",null,null,null,null,null,null,null,"Power Tools",0.13,0.25]
["Non-Sport Trading Card NFTs","#262052",null,null,"• And a closing fee of £0.50 per item sold",null,null,null,null,null,null,null,"Small Appliances",0.15,0.25]
[null,null,null,null,"Not applicable",null,null,null,null,null,null,null,"Software",0.15,0.25]
["Computers, Tablets & Networking, except subcategories below:","#58058",9.9000000000000005E-2,null,"Business, Industrial, and Scientific Supplies",null,null,null,null,null,null,null,"Sports & Outdoors",0.15,0.25]
["Desktops & All-In-Ones","#171957","6.9% for the portion of the total amount of the sale up to £1,000 (calculated per item)",null,0.153,null,null,null,null,null,null,null,"Toys & Games",0.15,0.25]
["Drives, Storage & Blank Media","#165","3% for the portion of the total amount of the sale above £1,000",null,0.25,null,null,null,null,null,null,null,"Video Games",0.15,0.25]
["Enterprise Networking, Servers","#175698",null,null,"Compact Appliances",null,null,null,null,null,null,null,"Watches","15.00% of the total item price up to the value of £225.00",0.25]
["Tablets & eBook Readers","#171485",null,null,0.153,null,null,null,null,null,null,null,null,"5.00% on any portion of the total item price greater than £225.00"]
["Laptops & Netbooks","#175672",null,null,0.25,null,null,null,null,null,null,null,"Everything Else",0.15,0.25]
["Printers, Scanners & Supplies","#171961",null,null,"Clothing and Accessories",null,null,null,null,null,null,null,"*All fees are subject to VAT where applicable"]
[null,null,null,null,"• For Prime selection with a total price above £40: 15.3% for products with a total price greater than £15 for the portion of the total price up to £40, and 7.14% for any portion of the total price greater than £40."]
["Crafts","#14339",0.129,null,"• For any selection with a total price up to £15: 8.16%"]
["Dolls & Bears","#237",0.109,null,"• For any selection with a total price greater than £15: 15.3%"]
["Event Tickets","#1305",0.129,null,0.25]
["Films & TV, except subcategories below:","#11232",9.9000000000000005E-2,null,"Commercial Electrical and Energy Supplies"]
["Film NFTs","#262053",0.05,null,0.12239999999999999]
[null,null,null,null,0.25]
["Garden & Patio","#159912",0.109,null,"Computers"]
["Health & Beauty, except subcategories below:","#26395",0.109,null,7.1400000000000005E-2]
["Hair Extensions & Wigs","#182101",0.11899999999999999,null,0.25]
[null,null,null,null,"Consumer Electronics"]
["Electronic Smoking, Parts & Accessories","#183497",0.129,null,7.1400000000000005E-2]
[null,null,null,null,0.25]
["Holidays & Travel","#3252","7.9% for the portion of the total amount of the sale up to £650 (calculated per item)",null,"Cycling Accessories"]
[null,null,"3% for the portion of the total amount of the sale above £650",null,8.1600000000000006E-2]
[null,null,null,null,0.25]
["Home, Furniture & DIY, except subcategories below:","#11700","11.9% for the portion of the total amount of the sale up to £500 (calculated per item)",null,"Electronic Accessories"]
[null,null,"7.9% for the portion of the total amount of the sale above £500",null,"• 15.3% for the portion of the total sales price up to ₤100.00"]
[null,null,null,null,"• 8.16% for any portion of the total sales price greater than ₤100.00"]
["Appliances","#20710","6.9% for the portion of the total amount of the sale up to £400 (calculated per item)",null,0.25]
["DIY Tools & Workshop Equipment","#631","3% for the portion of the total amount of the sale above £400",null,"Eyewear"]
[null,null,null,null,0.153]
["Power Strips & Surge Protectors","#67779","9.9% for the portion of the total amount of the sale up to £250 (calculated per item)",null,0.25]
[null,null,"7.9% for the portion of the total amount of the sale above £250",null,"Footwear"]
[null,null,null,null,0.153]
["Furniture","#3197","10.9% for the portion of the total amount of the sale up to £500 (calculated per item)",null,0.25]
["Bath","#26677","7.9% for the portion of the total amount of the sale above £500 and up to £1,000 (calculated per item)",null,"Full-Size Appliances"]
["Other Home Plumbing & Fixtures","#3191","3% for the portion of the total amount of the sale above £1,000",null,7.1400000000000005E-2]
[null,null,null,null,0.25]
["Jewellery & Watches, except subcategories below:","#281","12.9% for the portion of the total amount of the sale up to £450 (calculated per item)",null,"Furniture"]
[null,null,"2% for the portion of the total amount of the sale above £450",null,"• 15.3% for the portion of the total sales price up to £175.00"]
[null,null,null,null,"• 10.2% for any portion of the total sales price greater than £175.00"]
["Watches, Parts & Accessories","#260324","12.9% for the portion of the total amount of the sale up to £750 (calculated per item)",null,0.25]
[null,null,"3% for the portion of the total amount of the sale above £750",null,"Grocery and Gourmet"]
[null,null,null,null,"• 8.16% for products with a total sales price up to £10.00"]
["Mobile Phones & Communication, except subcategories below:","#15032",9.9000000000000005E-2,null,"• 15.3% for products with a total sales price greater than £10.00"]
["Mobile & Smart Phones","#9355","6.9% for the portion of the total amount of the sale up to £1,000 (calculated per item)",null,"Not applicable"]
[null,null,"3% for the portion of the total amount of the sale above £1,000",null,"Handmade"]
{"$rows_left_out":62}